Video Teratas
Pencarian Teratas
Baru Dilihat
Suasana & Genre
Autumn
Chill
Commute
Energize
Feel good
Focus
Gaming
Party
Romance
Sad
Sleep
Summer
Winter
Workout
African
Arabic
Blues
Bollywood & Indian
Classical
Country & Americana
Dance & electronic
Decades
Family
Folk & acoustic
German hip-hop
German pop
Hip-hop
Indie & alternative
J-Pop
Jazz
K-Pop
Latin
Mandopop & cantopop
Metal
Pop
R&B & soul
Reggae & caribbean
Rock
Schlager
Soundtracks & musicals
Akun Saya
Masuk
Daftar Putar Saya
Statistik Saya
Unggah
Blog
Fix Maven Build failure error
3:29
|
Memproses video...
Memuat...
Unduh
Video Berikutnya
Resolving BUILD FAILURE in Maven: A Simple Typo Fix
1:08
|
Video Terkait
1:08
Resolving BUILD FAILURE in Maven: A Simple Typo Fix
1:40
Build Failure: Maven Build | Error : While building the SpringBoot jar...
2:37
Troubleshooting BUILD FAILURE in Spring Boot Maven Projects
1:40
Fix Your Maven Build Failed Issue Caused by the Modernizer Plugin
1:45
How to Resolve Maven Error: Failing to Transfer a Specific Artifact
8:40
Fix Maven Build Error: invalid target release:...
1:10
How to Fix Could not Build Maven Project
4:48
How to Fix and Troubleshoot Maven FAQs - troubleshooting proxy and download errors
2:59
Fix Maven Build Errors for Spring Boot 2.5.3 After September 29, 2024 by Overriding Invalid Reposit
1:37
Resolving Maven Build Issues: Understanding Dependency Package Errors in Spring Boot Projects
1:37
Troubleshooting Maven Compile Package Does Not Exist Errors
3:56
Could not calculate build plan,Errors in Eclipse | Maven-Compiler & Maven-Jar Plugin Issues Resolved
8:53
Improve Gradle & Maven Build Reliability with Build Failure Analytics
1:22
Why Does My Maven Build Fail Despite All Test Cases Passing in a Selenium Webdriver Project?
2:24
Getting Started with Maven Build Scan for Troubleshooting Build Failures and Performance
7:32
How to Fix and Troubleshoot Maven FAQs - Troubleshooting Redownloading
1:10
Could not calculate build plan: Plugin org.apache.maven.plugins:maven-jar-plugin | Maven build issue
1:38
Resolving the Maven Dependency Issue: Cannot find symbol Error Explained
3:13
Fix Maven Error: PKIX Path Building Failed - Certification Path Issues