Videos Destacados
Búsquedas Populares
Vistos Recientemente
Estados de Ánimo y Géneros
Autumn
Chill
Commute
Energize
Feel good
Focus
Gaming
Party
Romance
Sad
Sleep
Summer
Winter
Workout
African
Arabic
Blues
Bollywood & Indian
Classical
Country & Americana
Dance & electronic
Decades
Family
Folk & acoustic
German hip-hop
German pop
Hip-hop
Indie & alternative
J-Pop
Jazz
K-Pop
Latin
Mandopop & cantopop
Metal
Pop
R&B & soul
Reggae & caribbean
Rock
Schlager
Soundtracks & musicals
Mi Cuenta
Iniciar Sesión
Mis Listas de Reproducción
Mis Estadísticas
Subir
Blog
Solving the React Native Build Failed Error
1:48
|
Procesando video...
Cargando...
Descargar
Siguiente Video
Fixing the no rule to process file 'main.jsbundle' Error in Xcode 16 for React Native iOS Builds
3:35
|
Videos Relacionados
3:18
Fix Gradle Errors in React Native | Step-by-Step Guide
3:03
Fixing Gradle build failed Error in React Native with EAS Build for Android
3:33
[Fixed] Gradle build failed with unknown error in Expo/React Native
1:39
Solving the Build Failed Error on iOS When Rebuilding React Native Projects
2:55
Fixing React Native iOS Build Error: node: No such file or directory in PhaseScriptExecution
3:35
Fixing the no rule to process file 'main.jsbundle' Error in Xcode 16 for React Native iOS Builds
3:14
Solved: React Native Build Failed | Reanimated & Gradle Lock Issue Fixed!
2:05
Solving the BUILD FAILED Issue in React Native When Integrating Firebase for iOS Apps
4:49
React Native 0.83.1 New Project Not Running? 🔥 Fix in 5 Minutes (NDK Issue)
3:51
How to Fix EAS Build Failed for Task expo splash screen
2:53
react-native-svg Build Issue in React Native 0.78: How to Fix the C+ + Build System Error
3:47
How to Fix app:compileDebugJavaWithJavac FAILED Error in React Native Project?
3:03
How to solve Build failed issue in React Native || Steps in Description
1:43
Resolving the react-native-screens:compileDebugKotlin FAILED Error in Your React Navigation Project
2:25
Fixing the com.facebook.react.settings Plugin Error in React Native Android Build
1:29
How to Fix 'Execution Failed for Task:app:checkDebugAarMetadata' in React Native Project?
2:40
Fixing react-native-gesture-handler Build Errors in React Native Android Projects
1:41
Solving React Native Build Failures on iOS due to RNSVG Errors
4:01
Fix React Native Setup and Environment Errors Automatically || Series 2026