Video Teratas
Pencarian Teratas
Baru Dilihat
Suasana & Genre
Autumn
Chill
Commute
Energize
Feel good
Focus
Gaming
Party
Romance
Sad
Sleep
Summer
Winter
Workout
African
Arabic
Blues
Bollywood & Indian
Classical
Country & Americana
Dance & electronic
Decades
Family
Folk & acoustic
German hip-hop
German pop
Hip-hop
Indie & alternative
J-Pop
Jazz
K-Pop
Latin
Mandopop & cantopop
Metal
Pop
R&B & soul
Reggae & caribbean
Rock
Schlager
Soundtracks & musicals
Akun Saya
Masuk
Daftar Putar Saya
Statistik Saya
Unggah
Blog
NodeJS : Error: Cannot find module 'babel-register'
1:13
|
Memproses video...
Memuat...
Unduh
Video Berikutnya
NodeJS : RollupJS `resolve failed: Error: Cannot find module 'babel-runtime'`
1:12
|
Video Terkait
6:34
Parsing error : Cannot find module 'next/babel'
1:31
Understanding and Resolving the Error: "Cannot Find Module 'babel-preset-es2015'"
1:43
How to Fix the Cannot Find Module '@ vue/cli-plugin-babel/preset' Error in Cypress Tests using Dock
3:04
Parsing error: No Babel config file detected for . in Vue.js Solved
1:40
Troubleshooting the "Babel Command Not Found" Error
4:11
How do use babel plugin module resolver in react native || how do i use aliases in react native
2:09
Resolving the Cannot find module Error When Importing TS Files into JS in Node.js
1:41
How to Fix the Type error: Cannot find type definition file for '@babel' in Your Next.js Project
5:20
Use babel-preset-env to Use Native Node Features and Also Use Babel Plugins
6:31
Setup Babel ES6 for Express and Nodejs [Update 2023]
4:09
Should you use Babel with Node?
3:26
Error: Module build failed (from ./node_modules/@angular-devkit/build-angular/src/tools/babel/web...
8:30
CONFIGURARE NODE.JS PER PROGRAMMARE CON JAVASCRIPT ES6 USANDO BABEL (TUTORIAL IN ITALIANO)
0:44
[SOLVED] Error Cannot find module 'webpack/lib/util/makeSerializable.js' Storybook
1:34
[SOLVED] Cannot find module 'Module name" React js/Next js 'framer-motion'.
1:27
Solución | Cannot find module 'webpack/lib/rules/DescriptionDataMatcherRulePlugin'Require stack:
3:21
nestjs swc Error: Cannot find module 'path-to-project/src/app.module'
2:52
babel-node is not recognized as an internal or external command, operable program or batch file
1:57
Fixing the Module Build Failed Error in Angular
1:18
Module not found problem in vs code | node:internal/modules/cjs/loader:1078throw err | Quick fix
7:37
Fixing Babel Dependency Issue in create react app project Error in 5 Minutes | Babel preset react
3:19
babel-jest doesn't handle ES6 within modules
1:12
NodeJS : RollupJS `resolve failed: Error: Cannot find module 'babel-runtime'`
4:48
webpack-dev-server - SOLVED!!! - Cannot find module 'webpack-dev-server'
0:43
Error: Cannot find module 'webpack-cli/bin/config-yargs' | Solved!!!
0:31
ERROR VUE Module not found Error Can't resolver 'vue' in
0:59
ESLint Failed to load config next babel to extend from npm run build error
8:41
Compiling JavaScript with Babel and writing your own Babel plugins
3:02
Fixing MODULE_NOT_FOUND Errors for Indirectly Imported Modules in Node.js Projects
2:07
One of your dependencies, babel-preset-react-app, is importing SOLVED in React JS
2:56
Webpack 2 - babel-loader - how to exclude node_modules?
1:34
05 - Publish and use Babel plugin developed in AST Explorer
3:04
How to fix ESLint couldn't find the plugin "eslint-plugin-prettier" error
1:39
Heroku nextjs - Type error Cannot find module 'next Link' or its corresponding type declarations
5:24
Error: Could not find the '@angular-devkit/build-angular:dev-server'
1:51
Modules in Node: CommonJS and ESM
3:05
can not use import statement outside a module in Nodejs
0:42
React js Webpack Error Module not found: Error: Can't resolve './component'
8:20
#EP-2.Cannot use import statements outside a module
9:46
Node.js Tutorial - 16 - ES Modules
1:41
Solución | BREAKING CHANGE:webpack 5 used to include polyfills for node.js core modules by default
7:17
A simple introduction to webpack, babel and SWC (used by Next.js)
9:41
How to use ES6 Module in node.js | How to use import and export statement in node js
5:12
Is Babel.js RUNNING OUT OF MONEY?
5:47
Start Using ES Modules Now
0:43
05. Como configurar Babel desde cero.
2:11
Babel Explained in 2 minutes | What is Babel? 🤯 #babel
2:05
✅Module not found: Error can’t resolve in react | ✅Uncaught ReferenceError | ②⓪②②
4:45
Installing and rebuilding Sqlite3 for use with Electron
0:55
What is Babel in react?
1:37
Resolving the ts-node Issue: Importing a JavaScript File with ES Modules
3:16
NPM Error [ERR_REQUIRE_ESM] solution for node-fetch
1:03
How to fix 'Cannot use import statement outside a module.'
3:32
ERROR in (webpack)-dev-server/client?http://0.0.0.0:0/sockjs-node | FIX 100% working | Angular App
6:00
#paradise_hope #ERROR in Error: Child compilation failed: Module.createRequire is not a function
3:28
How To Fix Unexpected Token Error for NPM Package in react project, react leaflet and other packages
6:56
19. Babel Loader Setup in the Webpack 4 Configuration file for compiling Code - Part 2. ES6 | ES2015
3:10
Native Code in Node.js in 3 MINS
2:36
CommonJS and ES6 Modules in Nodejs - built in module os
4:02
Module parse failed: Unexpected token (7855:112)
8:51
Electron & Sqlite3: Windows build (Fixing cannot find Module)
9:05
How to use ES Modules in Node.js (import & export)
0:42
Fix import error | eslint | Cannot read file 'tsconfig.json'
4:20
#12 - Nodejs - Module Aliases - Clean up your imports
2:54
Setting up Jest & ESM(ECMAScript Modules)
7:02
Fix Webpack 5 NPM Issues with Web3 and EthersJS using ReactJS
1:14
error:0308010C:digital envelope routines::unsupported at new Hash (node:internal/crypto/hash:68:19)
1:48
Export namespace should be first transformed by `@babel/plugin-proposal-export-namespace-from
7:23
Use ESM In A Node Project
4:38
webpack 5 - resolve fallback
4:00
How to configure Babel in Storybook? Storybook configuration.
8:07
Typescript and native ESM in node.js
3:25
error TS1259: Module can only be default-imported using the 'esModuleInterop' flag
7:45
How to install and setup Webpack using NodeJs (advance)
6:29
Node.js finally have a watch mode 😱
1:21
Resolving the Class extends value undefined Error in Next.js
1:32
Troubleshooting the "Can't Find Variable React" Error in Your Projects
4:54
Error HH8: There is one or more error in your config file.
2:01
[Resolved] npm ERR! Invalid name In Terminal | Resolve NPM Errors
7:21
eslint and prettier Node.js setup (cse341 lesson 3 class activity)
1:55
npm ERR! code EBADPLATFORM | notsup Unsupported platform | React | Command Prompt | VS Code Windows